Failure in check(), python-exceptiongroup

plover_plugins_manager requires python-requests-cache which requires python-exceptiongroup, which is giving me errors on installing:

╰─λ yay python-exceptiongroup
1 aur/python-exceptiongroup 1.0.0rc8-2 (+1 0.49) 
Backport of PEP 654 (exception groups)
==> Packages to install (eg: 1 2 3, 1-3 or ^4)
==> 1
:: Checking for conflicts...
:: Checking for inner conflicts...
[Aur:1]  python-exceptiongroup-1.0.0rc8-2

1 python-exceptiongroup            (Build Files Exist)
==> Packages to cleanBuild?
==> [N]one [A]ll [Ab]ort [I]nstalled [No]tInstalled or (1 2 3, 1-3, ^4)
==> 
:: PKGBUILD up to date, Skipping (1/0): python-exceptiongroup
1 python-exceptiongroup            (Build Files Exist)
==> Diffs to show?
==> [N]one [A]ll [Ab]ort [I]nstalled [No]tInstalled or (1 2 3, 1-3, ^4)
==> 
:: (1/1) Parsing SRCINFO: python-exceptiongroup
==> Making package: python-exceptiongroup 1.0.0rc8-2 (Sun 07 Aug 2022 04:10:14 PM EDT)
==> Retrieving sources...
-> Found python-exceptiongroup-1.0.0rc8.tar.gz
==> Validating source files with sha256sums...
python-exceptiongroup-1.0.0rc8.tar.gz ... Passed
==> Making package: python-exceptiongroup 1.0.0rc8-2 (Sun 07 Aug 2022 04:10:14 PM EDT)
==> Checking runtime dependencies...
==> Checking buildtime dependencies...
==> Retrieving sources...
-> Found python-exceptiongroup-1.0.0rc8.tar.gz
==> Validating source files with sha256sums...
python-exceptiongroup-1.0.0rc8.tar.gz ... Passed
==> Removing existing $srcdir/ directory...
==> Extracting sources...
-> Extracting python-exceptiongroup-1.0.0rc8.tar.gz with bsdtar
==> Sources are ready.
==> Making package: python-exceptiongroup 1.0.0rc8-2 (Sun 07 Aug 2022 04:10:16 PM EDT)
==> Checking runtime dependencies...
==> Checking buildtime dependencies...
==> WARNING: Using existing $srcdir/ tree
==> Removing existing $pkgdir/ directory...
==> Starting build()...
* Getting dependencies for wheel...
* Building wheel...
Successfully built exceptiongroup-1.0.0rc8-py3-none-any.whl
==> Starting check()...
========================================================================= test session starts ==========================================================================
platform linux -- Python 3.10.5, pytest-7.1.2, pluggy-1.0.0
PySide6 6.3.1 -- Qt runtime 6.3.1 -- Qt compiled 6.3.1
rootdir: /home/dublu/.cache/yay/python-exceptiongroup/src/exceptiongroup-1.0.0rc8, configfile: pyproject.toml, testpaths: tests
plugins: xvfb-2.0.0, requests-mock-1.9.3, qt-4.1.0, socket-0.5.1
collected 59 items                                                                                                                                                     

tests/test_catch.py ..............                                                                                                                               [ 23%]
tests/test_exceptions.py ..........................................                                                                                              [ 94%]
tests/test_formatting.py FFF                                                                                                                                     [100%]

=============================================================================== FAILURES ===============================================================================
___________________________________________________________________________ test_formatting ____________________________________________________________________________
CALL ERROR: Exceptions caught in Qt event loop:
________________________________________________________________________________
+ Exception Group Traceback (most recent call last):
|   File "/home/dublu/.cache/yay/python-exceptiongroup/src/exceptiongroup-1.0.0rc8/tests/test_formatting.py", line 20, in test_formatting
|     raise ExceptionGroup("test message", exceptions)
| exceptiongroup.ExceptionGroup: test message (2 sub-exceptions)
| Displays notes attached to the group too
+-+---------------- 1 ----------------
| Traceback (most recent call last):
|   File "/home/dublu/.cache/yay/python-exceptiongroup/src/exceptiongroup-1.0.0rc8/tests/test_formatting.py", line 9, in test_formatting
|     raise ValueError("foo")
| ValueError: foo
+---------------- 2 ----------------
| Traceback (most recent call last):
|   File "/home/dublu/.cache/yay/python-exceptiongroup/src/exceptiongroup-1.0.0rc8/tests/test_formatting.py", line 14, in test_formatting
|     raise RuntimeError("bar")
| RuntimeError: bar
| Note from bar handler
+------------------------------------
________________________________________________________________________________
____________________________________________________________________ test_formatting_exception_only ____________________________________________________________________
CALL ERROR: Exceptions caught in Qt event loop:
________________________________________________________________________________
+ Exception Group Traceback (most recent call last):
|   File "/home/dublu/.cache/yay/python-exceptiongroup/src/exceptiongroup-1.0.0rc8/tests/test_formatting.py", line 73, in test_formatting_exception_only
|     raise ExceptionGroup("test message", exceptions)
| exceptiongroup.ExceptionGroup: test message (2 sub-exceptions)
| Displays notes attached to the group too
+-+---------------- 1 ----------------
| Traceback (most recent call last):
|   File "/home/dublu/.cache/yay/python-exceptiongroup/src/exceptiongroup-1.0.0rc8/tests/test_formatting.py", line 62, in test_formatting_exception_only
|     raise ValueError("foo")
| ValueError: foo
+---------------- 2 ----------------
| Traceback (most recent call last):
|   File "/home/dublu/.cache/yay/python-exceptiongroup/src/exceptiongroup-1.0.0rc8/tests/test_formatting.py", line 67, in test_formatting_exception_only
|     raise RuntimeError("bar")
| RuntimeError: bar
| Note from bar handler
+------------------------------------
________________________________________________________________________________
_____________________________________________________________________ test_formatting_syntax_error _____________________________________________________________________
CALL ERROR: Exceptions caught in Qt event loop:
________________________________________________________________________________
Traceback (most recent call last):
File "/home/dublu/.cache/yay/python-exceptiongroup/src/exceptiongroup-1.0.0rc8/tests/test_formatting.py", line 114, in test_formatting_syntax_error
exec("//serser")
File "<string>", line 1
//serser
^^
SyntaxError: invalid syntax
________________________________________________________________________________
===================================================================== 3 failed, 56 passed in 0.20s =====================================================================
==> ERROR: A failure occurred in check().
Aborting...
-> error making: python-exceptiongroup

garuda-inxi:

System:
Kernel: 5.18.3-zen1-1-zen arch: x86_64 bits: 64 compiler: gcc v: 12.1.0
parameters: BOOT_IMAGE=/@/boot/vmlinuz-linux-zen
root=UUID=86ca4047-09c6-4d4b-8063-3c1297a95c65 rw [email protected]
quiet quiet splash rd.udev.log_priority=3 vt.global_cursor_default=0
resume=UUID=1c5a509e-1999-4fda-b0de-adcec793f36b loglevel=3 ibt=off
Desktop: KDE Plasma v: 5.25.4 tk: Qt v: 5.15.5 info: latte-dock
wm: kwin_x11 vt: 1 dm: SDDM Distro: Garuda Linux base: Arch Linux
Machine:
Type: Desktop Mobo: Micro-Star model: A320M PRO-M2 V2 (MS-7B84) v: 2.0
serial: <superuser required> UEFI: American Megatrends v: 3.10
date: 01/30/2019
CPU:
Info: model: AMD Ryzen 7 2700 bits: 64 type: MT MCP arch: Zen+ gen: 2
built: 2018-21 process: GF 12nm family: 0x17 (23) model-id: 8 stepping: 2
microcode: 0x800820D
Topology: cpus: 1x cores: 8 tpc: 2 threads: 16 smt: enabled cache:
L1: 768 KiB desc: d-8x32 KiB; i-8x64 KiB L2: 4 MiB desc: 8x512 KiB
L3: 16 MiB desc: 2x8 MiB
Speed (MHz): avg: 2628 high: 3391 min/max: 1550/3200 boost: enabled
scaling: driver: acpi-cpufreq governor: performance cores: 1: 2668 2: 2283
3: 2801 4: 2560 5: 2558 6: 2619 7: 2336 8: 2539 9: 2417 10: 2283 11: 3391
12: 2483 13: 3126 14: 3369 15: 2284 16: 2340 bogomips: 102385
Flags: avx avx2 ht lm nx pae sse sse2 sse3 sse4_1 sse4_2 sse4a ssse3 svm
Vulnerabilities:
Type: itlb_multihit status: Not affected
Type: l1tf status: Not affected
Type: mds status: Not affected
Type: meltdown status: Not affected
Type: spec_store_bypass mitigation: Speculative Store Bypass disabled via
prctl
Type: spectre_v1 mitigation: usercopy/swapgs barriers and __user pointer
sanitization
Type: spectre_v2 mitigation: Retpolines, IBPB: conditional, STIBP:
disabled, RSB filling
Type: srbds status: Not affected
Type: tsx_async_abort status: Not affected
Graphics:
Device-1: NVIDIA TU116 [GeForce GTX 1660 SUPER] vendor: Micro-Star MSI
driver: nvidia v: 515.48.07 alternate: nouveau,nvidia_drm non-free: 515.xx+
status: current (as of 2022-07) arch: Turing code: TUxxx
process: TSMC 12nm built: 2018-22 pcie: gen: 3 speed: 8 GT/s lanes: 16
bus-ID: 1f:00.0 chip-ID: 10de:21c4 class-ID: 0300
Device-2: Focusrite-Novation Scarlett 2i2 Camera type: USB
driver: snd-usb-audio,usb-storage bus-ID: 5-4:12 chip-ID: 1235:8210
class-ID: 0806 serial: <filter>
Display: x11 server: X.Org v: 21.1.3 with: Xwayland v: 22.1.3
compositor: kwin_x11 driver: X: loaded: nvidia
unloaded: modesetting,nouveau alternate: fbdev,nv,vesa gpu: nvidia
display-ID: :0 screens: 1
Screen-1: 0 s-res: 3280x1080 s-dpi: 39 s-size: 2135x703mm (84.06x27.68")
s-diag: 2248mm (88.49")
Monitor-1: DP-0 pos: primary,left res: 1920x1080 dpi: 82
size: 598x336mm (23.54x13.23") diag: 686mm (27.01") modes: N/A
Monitor-2: DP-3 pos: right res: 1360x768 hz: 60 dpi: 42
size: 820x460mm (32.28x18.11") diag: 940mm (37.02") modes: N/A
OpenGL: renderer: N/A v: N/A direct render: N/A
Audio:
Device-1: NVIDIA TU116 High Definition Audio vendor: Micro-Star MSI
driver: snd_hda_intel bus-ID: 5-4:12 v: kernel chip-ID: 1235:8210 pcie:
class-ID: 0806 gen: 3 serial: <filter> speed: 8 GT/s lanes: 16
bus-ID: 1f:00.1 chip-ID: 10de:1aeb class-ID: 0403
Device-2: AMD Family 17h HD Audio vendor: Micro-Star MSI
driver: snd_hda_intel v: kernel pcie: gen: 3 speed: 8 GT/s lanes: 16
bus-ID: 21:00.3 chip-ID: 1022:1457 class-ID: 0403
Device-3: Focusrite-Novation Scarlett 2i2 Camera type: USB
driver: snd-usb-audio,usb-storage
Sound Server-1: ALSA v: k5.18.3-zen1-1-zen running: yes
Sound Server-2: sndio v: N/A running: no
Sound Server-3: PulseAudio v: 16.1 running: no
Sound Server-4: PipeWire v: 0.3.56 running: yes
Network:
Device-1: Realtek RTL8111/8168/8411 PCI Express Gigabit Ethernet
vendor: Micro-Star MSI driver: r8169 v: kernel pcie: gen: 1 speed: 2.5 GT/s
lanes: 1 port: f000 bus-ID: 1b:00.0 chip-ID: 10ec:8168 class-ID: 0200
IF: enp27s0 state: up speed: 1000 Mbps duplex: full mac: <filter>
IF-ID-1: anbox0 state: down mac: <filter>
Bluetooth:
Device-1: Cambridge Silicon Radio Bluetooth Dongle (HCI mode) type: USB
driver: btusb v: 0.8 bus-ID: 1-4:3 chip-ID: 0a12:0001 class-ID: e001
Report: bt-adapter ID: hci0 rfk-id: 6 state: up address: <filter>
Drives:
Local Storage: total: 3.89 TiB used: 573.65 GiB (14.4%)
SMART Message: Unable to run smartctl. Root privileges required.
ID-1: /dev/sda maj-min: 8:0 vendor: Seagate model: ST2000DM008-2FR102
size: 1.82 TiB block-size: physical: 4096 B logical: 512 B speed: 6.0 Gb/s
type: HDD rpm: 7200 serial: <filter> rev: 0001 scheme: GPT
ID-2: /dev/sdb maj-min: 8:16 vendor: Kingston model: SA400S37240G
size: 223.57 GiB block-size: physical: 512 B logical: 512 B speed: 6.0 Gb/s
type: SSD serial: <filter> rev: 0009 scheme: GPT
ID-3: /dev/sdc maj-min: 8:32 type: USB vendor: SanDisk model: Extreme Pro
55AF size: 1.82 TiB block-size: physical: 512 B logical: 512 B type: N/A
serial: <filter> rev: 1084 scheme: GPT
SMART Message: Unknown USB bridge. Flash drive/Unsupported enclosure?
ID-4: /dev/sdd maj-min: 8:48 type: USB model: USB DISK 2.0
size: 28.88 GiB block-size: physical: 512 B logical: 512 B type: N/A
serial: <filter> rev: PMAP scheme: MBR
SMART Message: Unknown USB bridge. Flash drive/Unsupported enclosure?
ID-5: /dev/sde maj-min: 8:64 type: USB model: Scarlett Welcome Disk
size: 192 KiB block-size: physical: 512 B logical: 512 B type: N/A
serial: <filter> rev: 0.10 scheme: MBR
SMART Message: Unknown USB bridge. Flash drive/Unsupported enclosure?
Partition:
ID-1: / raw-size: 200 GiB size: 200 GiB (100.00%) used: 70.64 GiB (35.3%)
fs: btrfs dev: /dev/sdb1 maj-min: 8:17
ID-2: /boot/efi raw-size: 512 MiB size: 511 MiB (99.80%) used: 576 KiB
(0.1%) fs: vfat dev: /dev/sdb3 maj-min: 8:19
ID-3: /home raw-size: 1.82 TiB size: 1.82 TiB (100.00%) used: 49.36 GiB
(2.6%) fs: btrfs dev: /dev/sda1 maj-min: 8:1
ID-4: /var/log raw-size: 200 GiB size: 200 GiB (100.00%) used: 70.64 GiB
(35.3%) fs: btrfs dev: /dev/sdb1 maj-min: 8:17
ID-5: /var/tmp raw-size: 200 GiB size: 200 GiB (100.00%) used: 70.64 GiB
(35.3%) fs: btrfs dev: /dev/sdb1 maj-min: 8:17
Swap:
Kernel: swappiness: 133 (default 60) cache-pressure: 100 (default)
ID-1: swap-1 type: zram size: 15.57 GiB used: 3.15 GiB (20.2%)
priority: 100 dev: /dev/zram0
ID-2: swap-2 type: partition size: 23.07 GiB used: 0 KiB (0.0%)
priority: -2 dev: /dev/sdb2 maj-min: 8:18
Sensors:
System Temperatures: cpu: 54.1 C mobo: N/A gpu: nvidia temp: 60 C
Fan Speeds (RPM): N/A gpu: nvidia fan: 0%
Info:
Processes: 454 Uptime: 52d 21h 42m wakeups: 0 Memory: 15.57 GiB used: 7.25
GiB (46.6%) Init: systemd v: 251 default: graphical tool: systemctl
Compilers: gcc: 12.1.1 clang: 14.0.6 Packages: pacman: 2401 lib: 595
Shell: fish v: 3.5.1 running-in: konsole inxi: 3.3.20
Garuda (2.6.5-1):
System install date:     2022-04-16
Last full system update: 2022-08-07 ↻
Is partially upgraded:   No
Relevant software:       NetworkManager
Windows dual boot:       No/Undetected
Snapshots:               Snapper
Failed units:            anbox-container-manager.service [email protected] [email protected] [email protected] systemd-networkd-wait-online.service

First reboot, please.
Try Again. :slight_smile:

Did you search about the errors in web?
Here too

?

You must know, our search engine :wink: is in Holidays, greetings to @filo :slight_smile:

4 Likes

I got too much sun to do anything :sunglasses:

5 Likes