Nvidia-dkms build failed for kernel 6.8.8-AMD

Hi. While system update, i had a error

Error! Bad return status for module build on kernel: 6.8.8-AMD (x86_64)
Consult /var/lib/dkms/nvidia/550.78/build/make.log for more information.
---> Failed to build NVIDIA DKMS module for kernel 6.8.8-AMD

Log /var/lib/dkms/nvidia/550.78/build/make.log content:

DKMS make.log for nvidia-550.78 for kernel 6.8.8-AMD (x86_64)
Ср 15 мая 2024 11:54:08 MSK
make[1]: вход в каталог «/usr/lib/modules/6.8.8-AMD/build»
warning: the compiler differs from the one used to build the kernel
  The kernel was built by: gcc (GCC) 13.2.1 20240417
  You are using:           gcc (GCC) 14.1.1 20240507

Warning: Compiler version check failed:

The major and minor number of the compiler used to
compile the kernel:

gcc (GCC) 13.2.1 20240417, GNU ld (GNU Binutils) 2.42.0

does not match the compiler used here:

gcc (GCC) 14.1.1 20240507
Copyright (C) 2024 Free Software Foundation, Inc.
Это свободно распространяемое программное обеспечение. Условия копирования
приведены в исходных текстах.

  Без гарантии каких-либо качеств, включая 
коммерческую ценность и применимость для каких-либо целей.




It is recommended to set the CC environment variable
to the compiler that was used to compile the kernel.

To skip the test and silence this warning message, set
the IGNORE_CC_MISMATCH environment variable to "1".
However, mixing compiler versions between the kernel
and kernel modules can result in subtle bugs that are
difficult to diagnose.

*** Failed CC version check. ***

  SYMLINK /var/lib/dkms/nvidia/550.78/build/nvidia/nv-kernel.o
  SYMLINK /var/lib/dkms/nvidia/550.78/build/nvidia-modeset/nv-modeset-kernel.o
 CONFTEST: hash__remap_4k_pfn
 CONFTEST: set_pages_uc
 CONFTEST: list_is_first
 CONFTEST: set_memory_uc
 CONFTEST: set_memory_array_uc
 CONFTEST: set_pages_array_uc
 CONFTEST: ioremap_cache
 CONFTEST: ioremap_wc
 CONFTEST: ioremap_driver_hardened
 CONFTEST: ioremap_driver_hardened_wc
 CONFTEST: ioremap_cache_shared
 CONFTEST: pci_get_domain_bus_and_slot
 CONFTEST: get_num_physpages
 CONFTEST: pde_data
 CONFTEST: xen_ioemu_inject_msi
 CONFTEST: phys_to_dma
 CONFTEST: get_dma_ops
 CONFTEST: dma_attr_macros
 CONFTEST: dma_map_page_attrs
 CONFTEST: write_cr4
 CONFTEST: of_find_node_by_phandle
 CONFTEST: of_node_to_nid
 CONFTEST: pnv_pci_get_npu_dev
 CONFTEST: of_get_ibm_chip_id
 CONFTEST: pci_bus_address
 CONFTEST: pci_stop_and_remove_bus_device
 CONFTEST: pci_rebar_get_possible_sizes
 CONFTEST: wait_for_random_bytes
 CONFTEST: register_cpu_notifier
 CONFTEST: cpuhp_setup_state
 CONFTEST: dma_map_resource
 CONFTEST: get_backlight_device_by_name
 CONFTEST: timer_setup
 CONFTEST: pci_enable_msix_range
 CONFTEST: kernel_read_has_pointer_pos_arg
 CONFTEST: kernel_write_has_pointer_pos_arg
 CONFTEST: dma_direct_map_resource
 CONFTEST: tegra_get_platform
 CONFTEST: tegra_bpmp_send_receive
 CONFTEST: flush_cache_all
 CONFTEST: vmf_insert_pfn
 CONFTEST: jiffies_to_timespec
 CONFTEST: ktime_get_raw_ts64
 CONFTEST: ktime_get_real_ts64
 CONFTEST: full_name_hash
 CONFTEST: pci_enable_atomic_ops_to_root
 CONFTEST: vga_tryget
 CONFTEST: cc_platform_has
 CONFTEST: seq_read_iter
 CONFTEST: unsafe_follow_pfn
 CONFTEST: drm_gem_object_get
 CONFTEST: drm_gem_object_put_unlocked
 CONFTEST: add_memory_driver_managed
 CONFTEST: device_property_read_u64
 CONFTEST: devm_of_platform_populate
 CONFTEST: of_dma_configure
 CONFTEST: of_property_count_elems_of_size
 CONFTEST: of_property_read_variable_u8_array
 CONFTEST: of_property_read_variable_u32_array
 CONFTEST: i2c_new_client_device
 CONFTEST: i2c_unregister_device
 CONFTEST: of_get_named_gpio
 CONFTEST: devm_gpio_request_one
 CONFTEST: gpio_direction_input
 CONFTEST: gpio_direction_output
 CONFTEST: gpio_get_value
 CONFTEST: gpio_set_value
 CONFTEST: gpio_to_irq
 CONFTEST: icc_get
 CONFTEST: icc_put
 CONFTEST: icc_set_bw
 CONFTEST: dma_buf_export_args
 CONFTEST: dma_buf_ops_has_kmap
 CONFTEST: dma_buf_ops_has_kmap_atomic
 CONFTEST: dma_buf_ops_has_map
 CONFTEST: dma_buf_ops_has_map_atomic
 CONFTEST: dma_buf_has_dynamic_attachment
 CONFTEST: dma_buf_attachment_has_peer2peer
 CONFTEST: dma_set_mask_and_coherent
 CONFTEST: devm_clk_bulk_get_all
 CONFTEST: get_task_ioprio
 CONFTEST: mdev_set_iommu_device
 CONFTEST: offline_and_remove_memory
 CONFTEST: crypto_tfm_ctx_aligned
 CONFTEST: wait_on_bit_lock_argument_count
 CONFTEST: radix_tree_empty
 CONFTEST: radix_tree_replace_slot
 CONFTEST: pnv_npu2_init_context
 CONFTEST: cpumask_of_node
 CONFTEST: ioasid_get
 CONFTEST: mm_pasid_drop
 CONFTEST: mmget_not_zero
 CONFTEST: mmgrab
 CONFTEST: iommu_sva_bind_device_has_drvdata_arg
 CONFTEST: vm_fault_to_errno
 CONFTEST: find_next_bit_wrap
 CONFTEST: iommu_is_dma_domain
 CONFTEST: acpi_video_backlight_use_native
 CONFTEST: drm_dev_unref
 CONFTEST: drm_reinit_primary_mode_group
 CONFTEST: get_user_pages_remote
 CONFTEST: get_user_pages
 CONFTEST: pin_user_pages_remote
 CONFTEST: pin_user_pages
 CONFTEST: drm_gem_object_lookup
 CONFTEST: drm_atomic_state_ref_counting
 CONFTEST: drm_driver_has_gem_prime_res_obj
 CONFTEST: drm_atomic_helper_connector_dpms
 CONFTEST: drm_connector_funcs_have_mode_in_name
 CONFTEST: drm_connector_has_vrr_capable_property
 CONFTEST: drm_framebuffer_get
 CONFTEST: drm_dev_put
 CONFTEST: drm_format_num_planes
 CONFTEST: drm_connector_for_each_possible_encoder
 CONFTEST: drm_rotation_available
 CONFTEST: drm_vma_offset_exact_lookup_locked
 CONFTEST: nvhost_dma_fence_unpack
 CONFTEST: dma_fence_set_error
 CONFTEST: fence_set_error
 CONFTEST: sync_file_get_fence
 CONFTEST: drm_aperture_remove_conflicting_pci_framebuffers
 CONFTEST: drm_fbdev_generic_setup
 CONFTEST: drm_connector_attach_hdr_output_metadata_property
 CONFTEST: drm_helper_crtc_enable_color_mgmt
 CONFTEST: drm_crtc_enable_color_mgmt
 CONFTEST: drm_atomic_helper_legacy_gamma_set
 CONFTEST: is_export_symbol_gpl_of_node_to_nid
 CONFTEST: is_export_symbol_gpl_sme_active
 CONFTEST: is_export_symbol_present_swiotlb_map_sg_attrs
 CONFTEST: is_export_symbol_present_swiotlb_dma_ops
 CONFTEST: is_export_symbol_present___close_fd
 CONFTEST: is_export_symbol_present_close_fd
 CONFTEST: is_export_symbol_present_get_unused_fd
 CONFTEST: is_export_symbol_present_get_unused_fd_flags
 CONFTEST: is_export_symbol_present_nvhost_get_default_device
 CONFTEST: is_export_symbol_present_nvhost_syncpt_unit_interface_get_byte_offset
 CONFTEST: is_export_symbol_present_nvhost_syncpt_unit_interface_get_aperture
 CONFTEST: is_export_symbol_present_tegra_dce_register_ipc_client
 CONFTEST: is_export_symbol_present_tegra_dce_unregister_ipc_client
 CONFTEST: is_export_symbol_present_tegra_dce_client_ipc_send_recv
 CONFTEST: is_export_symbol_present_dram_clk_to_mc_clk
 CONFTEST: is_export_symbol_present_get_dram_num_channels
 CONFTEST: is_export_symbol_present_tegra_dram_types
 CONFTEST: is_export_symbol_present_pxm_to_node
 CONFTEST: is_export_symbol_present_screen_info
 CONFTEST: is_export_symbol_gpl_screen_info
 CONFTEST: is_export_symbol_present_i2c_bus_status
 CONFTEST: is_export_symbol_present_tegra_fuse_control_read
 CONFTEST: is_export_symbol_present_tegra_get_platform
 CONFTEST: is_export_symbol_present_pci_find_host_bridge
 CONFTEST: is_export_symbol_present_tsec_comms_send_cmd
 CONFTEST: is_export_symbol_present_tsec_comms_set_init_cb
 CONFTEST: is_export_symbol_present_tsec_comms_clear_init_cb
 CONFTEST: is_export_symbol_present_tsec_comms_alloc_mem_from_gscco
 CONFTEST: is_export_symbol_present_tsec_comms_free_gscco_mem
 CONFTEST: is_export_symbol_present_memory_block_size_bytes
 CONFTEST: crypto
 CONFTEST: is_export_symbol_present_int_active_memcg
 CONFTEST: is_export_symbol_present_migrate_vma_setup
 CONFTEST: dma_ops
 CONFTEST: swiotlb_dma_ops
 CONFTEST: noncoherent_swiotlb_dma_ops
 CONFTEST: vm_fault_has_address
 CONFTEST: vm_insert_pfn_prot
 CONFTEST: vmf_insert_pfn_prot
 CONFTEST: vm_ops_fault_removed_vma_arg
 CONFTEST: kmem_cache_has_kobj_remove_work
 CONFTEST: sysfs_slab_unlink
 CONFTEST: proc_ops
 CONFTEST: timespec64
 CONFTEST: vmalloc_has_pgprot_t_arg
 CONFTEST: mm_has_mmap_lock
 CONFTEST: pci_channel_state
 CONFTEST: pci_dev_has_ats_enabled
 CONFTEST: remove_memory_has_nid_arg
 CONFTEST: add_memory_driver_managed_has_mhp_flags_arg
 CONFTEST: num_registered_fb
 CONFTEST: pci_driver_has_driver_managed_dma
 CONFTEST: vm_area_struct_has_const_vm_flags
 CONFTEST: memory_failure_has_trapno_arg
 CONFTEST: foll_longterm_present
 CONFTEST: backing_dev_info
 CONFTEST: mm_context_t
 CONFTEST: vm_fault_t
 CONFTEST: mmu_notifier_ops_invalidate_range
 CONFTEST: mmu_notifier_ops_arch_invalidate_secondary_tlbs
 CONFTEST: migrate_vma_added_flags
 CONFTEST: migrate_device_range
 CONFTEST: handle_mm_fault_has_mm_arg
 CONFTEST: handle_mm_fault_has_pt_regs_arg
 CONFTEST: mempolicy_has_unified_nodes
 CONFTEST: mempolicy_has_home_node
 CONFTEST: mpol_preferred_many_present
 CONFTEST: mmu_interval_notifier
 CONFTEST: drm_bus_present
 CONFTEST: drm_bus_has_bus_type
 CONFTEST: drm_bus_has_get_irq
 CONFTEST: drm_bus_has_get_name
 CONFTEST: drm_driver_has_device_list
 CONFTEST: drm_driver_has_legacy_dev_list
 CONFTEST: drm_driver_has_set_busid
 CONFTEST: drm_crtc_state_has_connectors_changed
 CONFTEST: drm_init_function_args
 CONFTEST: drm_helper_mode_fill_fb_struct
 CONFTEST: drm_master_drop_has_from_release_arg
 CONFTEST: drm_driver_unload_has_int_return_type
 CONFTEST: drm_atomic_helper_crtc_destroy_state_has_crtc_arg
 CONFTEST: drm_atomic_helper_plane_destroy_state_has_plane_arg
 CONFTEST: drm_mode_object_find_has_file_priv_arg
 CONFTEST: dma_buf_owner
 CONFTEST: drm_connector_list_iter
 CONFTEST: drm_atomic_helper_swap_state_has_stall_arg
 CONFTEST: drm_driver_prime_flag_present
 CONFTEST: drm_gem_object_has_resv
 CONFTEST: drm_crtc_state_has_async_flip
 CONFTEST: drm_crtc_state_has_pageflip_flags
 CONFTEST: drm_crtc_state_has_vrr_enabled
 CONFTEST: drm_format_modifiers_present
 CONFTEST: drm_vma_node_is_allowed_has_tag_arg
 CONFTEST: drm_vma_offset_node_has_readonly
 CONFTEST: drm_display_mode_has_vrefresh
 CONFTEST: drm_driver_master_set_has_int_return_type
 CONFTEST: drm_driver_has_gem_free_object
 CONFTEST: drm_prime_pages_to_sg_has_drm_device_arg
 CONFTEST: drm_driver_has_gem_prime_callbacks
 CONFTEST: drm_crtc_atomic_check_has_atomic_state_arg
 CONFTEST: drm_gem_object_vmap_has_map_arg
 CONFTEST: drm_plane_atomic_check_has_atomic_state_arg
 CONFTEST: drm_device_has_pdev
 CONFTEST: drm_crtc_state_has_no_vblank
 CONFTEST: drm_mode_config_has_allow_fb_modifiers
 CONFTEST: drm_has_hdr_output_metadata
 CONFTEST: dma_resv_add_fence
 CONFTEST: dma_resv_reserve_fences
 CONFTEST: reservation_object_reserve_shared_has_num_fences_arg
 CONFTEST: drm_connector_has_override_edid
 CONFTEST: drm_master_has_leases
 CONFTEST: drm_file_get_master
 CONFTEST: drm_modeset_lock_all_end
 CONFTEST: drm_connector_lookup
 CONFTEST: drm_connector_put
 CONFTEST: drm_driver_has_dumb_destroy
 CONFTEST: fence_ops_use_64bit_seqno
 CONFTEST: drm_aperture_remove_conflicting_pci_framebuffers_has_driver_arg
 CONFTEST: drm_mode_create_dp_colorspace_property_has_supported_colorspaces_arg
 CONFTEST: drm_unlocked_ioctl_flag_present
 CONFTEST: dom0_kernel_present
 CONFTEST: nvidia_vgpu_kvm_build
 CONFTEST: nvidia_grid_build
 CONFTEST: nvidia_grid_csp_build
 CONFTEST: pm_runtime_available
 CONFTEST: pci_class_multimedia_hd_audio
 CONFTEST: drm_available
 CONFTEST: vfio_pci_core_available
 CONFTEST: mdev_available
 CONFTEST: cmd_uphy_display_port_init
 CONFTEST: cmd_uphy_display_port_off
 CONFTEST: memory_failure_mf_sw_simulated_defined
 CONFTEST: drm_atomic_available
 CONFTEST: is_export_symbol_gpl_refcount_inc
 CONFTEST: is_export_symbol_gpl_refcount_dec_and_test
 CONFTEST: drm_alpha_blending_available
 CONFTEST: is_export_symbol_present_drm_gem_prime_fd_to_handle
 CONFTEST: is_export_symbol_present_drm_gem_prime_handle_to_fd
 CONFTEST: ib_peer_memory_symbols
  CC [M]  /var/lib/dkms/nvidia/550.78/build/nvidia/nv.o
  CC [M]  /var/lib/dkms/nvidia/550.78/build/nvidia/nv-pci.o
  CC [M]  /var/lib/dkms/nvidia/550.78/build/nvidia/nv-dmabuf.o
  CC [M]  /var/lib/dkms/nvidia/550.78/build/nvidia/nv-nano-timer.o
  CC [M]  /var/lib/dkms/nvidia/550.78/build/nvidia/nv-acpi.o
cc1: ошибка: cannot load plugin ./scripts/gcc-plugins/stackleak_plugin.so: ./scripts/gcc-plugins/stackleak_plugin.so: undefined symbol: _ZNK6frange10contains_pEP9tree_node
cc1: ошибка: cannot load plugin ./scripts/gcc-plugins/stackleak_plugin.so: ./scripts/gcc-plugins/stackleak_plugin.so: undefined symbol: _ZNK6frange10contains_pEP9tree_node
  CC [M]  /var/lib/dkms/nvidia/550.78/build/nvidia/nv-cray.o
cc1: ошибка: cannot load plugin ./scripts/gcc-plugins/stackleak_plugin.so: ./scripts/gcc-plugins/stackleak_plugin.so: undefined symbol: _ZNK6frange10contains_pEP9tree_node
  CC [M]  /var/lib/dkms/nvidia/550.78/build/nvidia/nv-dma.o
make[3]: *** [scripts/Makefile.build:243: /var/lib/dkms/nvidia/550.78/build/nvidia/nv.o] Ошибка 1
make[3]: *** Ожидание завершения заданий…
make[3]: *** [scripts/Makefile.build:243: /var/lib/dkms/nvidia/550.78/build/nvidia/nv-pci.o] Ошибка 1
make[3]: *** [scripts/Makefile.build:243: /var/lib/dkms/nvidia/550.78/build/nvidia/nv-dmabuf.o] Ошибка 1
cc1: ошибка: cannot load plugin ./scripts/gcc-plugins/stackleak_plugin.so: ./scripts/gcc-plugins/stackleak_plugin.so: undefined symbol: _ZNK6frange10contains_pEP9tree_node
make[3]: *** [scripts/Makefile.build:243: /var/lib/dkms/nvidia/550.78/build/nvidia/nv-nano-timer.o] Ошибка 1
cc1: ошибка: cannot load plugin ./scripts/gcc-plugins/stackleak_plugin.so: ./scripts/gcc-plugins/stackleak_plugin.so: undefined symbol: _ZNK6frange10contains_pEP9tree_node
cc1: ошибка: cannot load plugin ./scripts/gcc-plugins/stackleak_plugin.so: ./scripts/gcc-plugins/stackleak_plugin.so: undefined symbol: _ZNK6frange10contains_pEP9tree_node
make[3]: *** [scripts/Makefile.build:243: /var/lib/dkms/nvidia/550.78/build/nvidia/nv-acpi.o] Ошибка 1
make[3]: *** [scripts/Makefile.build:243: /var/lib/dkms/nvidia/550.78/build/nvidia/nv-cray.o] Ошибка 1
cc1: ошибка: cannot load plugin ./scripts/gcc-plugins/stackleak_plugin.so: ./scripts/gcc-plugins/stackleak_plugin.so: undefined symbol: _ZNK6frange10contains_pEP9tree_node
make[3]: *** [scripts/Makefile.build:243: /var/lib/dkms/nvidia/550.78/build/nvidia/nv-dma.o] Ошибка 1
make[2]: *** [/usr/lib/modules/6.8.8-AMD/build/Makefile:1921: /var/lib/dkms/nvidia/550.78/build] Ошибка 2
make[1]: *** [Makefile:240: __sub-make] Ошибка 2
make[1]: выход из каталога «/usr/lib/modules/6.8.8-AMD/build»
make: *** [Makefile:85: modules] Ошибка 2

My garuda-inxi

System:
Kernel: 6.8.9-zen1-2-zen arch: x86_64 bits: 64 compiler: gcc v: 14.1.1
clocksource: tsc avail: hpet,acpi_pm
parameters: BOOT_IMAGE=/vmlinuz-linux-zen
root=UUID=bfc36042-8f8e-4781-beaa-4e24b4c8225c rw rootflags=subvol=@
quiet loglevel=3 ibt=off
Desktop: KDE Plasma v: 6.0.4 tk: Qt v: N/A info: frameworks v: 6.2.0
wm: kwin_x11 vt: 2 dm: SDDM Distro: Garuda base: Arch Linux
Machine:
Type: Desktop System: Micro-Star product: MS-7E27 v: 1.0
serial: <superuser required>
Mobo: Micro-Star model: PRO B650M-P (MS-7E27) v: 1.0
serial: <superuser required> uuid: <superuser required> UEFI: American
Megatrends LLC. v: 1.50 date: 12/15/2023
Battery:
Device-1: hidpp_battery_0 model: Logitech G305 Lightspeed Wireless Gaming
Mouse serial: <filter> charge: 55% (should be ignored) rechargeable: yes
status: discharging
CPU:
Info: model: AMD Ryzen 5 7600 bits: 64 type: MT MCP arch: Zen 4 gen: 5
level: v4 note: check built: 2022+ process: TSMC n5 (5nm) family: 0x19 (25)
model-id: 0x61 (97) stepping: 2 microcode: 0xA601206
Topology: cpus: 1x cores: 6 tpc: 2 threads: 12 smt: enabled cache:
L1: 384 KiB desc: d-6x32 KiB; i-6x32 KiB L2: 6 MiB desc: 6x1024 KiB
L3: 32 MiB desc: 1x32 MiB
Speed (MHz): avg: 1228 high: 3835 min/max: 400/5170 scaling:
driver: amd-pstate-epp governor: powersave cores: 1: 3643 2: 3835 3: 400
4: 400 5: 400 6: 400 7: 3666 8: 400 9: 400 10: 400 11: 400 12: 400
bogomips: 91195
Flags: avx avx2 ht lm nx pae sse sse2 sse3 sse4_1 sse4_2 sse4a ssse3 svm
Vulnerabilities: <filter>
Graphics:
Device-1: NVIDIA AD104 [GeForce RTX 4070 SUPER] vendor: Micro-Star MSI
driver: nvidia v: 550.78 alternate: nouveau,nvidia_drm non-free: 550.xx+
status: current (as of 2024-04) arch: Lovelace code: AD1xx
process: TSMC n4 (5nm) built: 2022+ pcie: gen: 2 speed: 5 GT/s lanes: 16
link-max: gen: 4 speed: 16 GT/s ports: active: none off: HDMI-A-1
empty: DP-1,DP-2,DP-3 bus-ID: 01:00.0 chip-ID: 10de:2783 class-ID: 0300
Device-2: AMD Raphael vendor: Micro-Star MSI driver: amdgpu v: kernel
arch: RDNA-2 code: Navi-2x process: TSMC n7 (7nm) built: 2020-22 pcie:
gen: 4 speed: 16 GT/s lanes: 16 ports: active: none empty: DP-4, DP-5,
DP-6, HDMI-A-2, Writeback-1 bus-ID: 10:00.0 chip-ID: 1002:164e
class-ID: 0300 temp: 34.0 C
Display: x11 server: X.Org v: 21.1.13 with: Xwayland v: 23.2.6
compositor: kwin_x11 driver: X: loaded: amdgpu,nvidia
unloaded: modesetting,nouveau alternate: fbdev,nv,vesa dri: radeonsi
gpu: nvidia,nvidia-nvswitch display-ID: :0 screens: 1
Screen-1: 0 s-res: 1920x1080 s-dpi: 92 s-size: 530x292mm (20.87x11.50")
s-diag: 605mm (23.82")
Monitor-1: HDMI-A-1 mapped: HDMI-0 note: disabled model: V24FAB-RA
serial: <filter> built: 2022 res: 1920x1080 hz: 60 dpi: 93 gamma: 1.2
size: 527x293mm (20.75x11.54") diag: 603mm (23.7") ratio: 16:9 modes:
max: 1920x1080 min: 640x480
API: EGL v: 1.5 hw: drv: nvidia drv: amd radeonsi platforms: device: 0
drv: nvidia device: 2 drv: radeonsi device: 3 drv: swrast gbm: drv: nvidia
surfaceless: drv: nvidia x11: drv: nvidia inactive: wayland,device-1
API: OpenGL v: 4.6.0 compat-v: 4.5 vendor: nvidia mesa v: 550.78
glx-v: 1.4 direct-render: yes renderer: NVIDIA GeForce RTX 4070
SUPER/PCIe/SSE2 memory: 11.71 GiB
API: Vulkan v: 1.3.279 layers: 10 device: 0 type: discrete-gpu name: NVIDIA
GeForce RTX 4070 SUPER driver: nvidia v: 550.78 device-ID: 10de:2783
surfaces: xcb,xlib device: 1 type: integrated-gpu name: AMD Radeon
Graphics (RADV RAPHAEL_MENDOCINO) driver: mesa radv v: 24.0.7-arch1.3
device-ID: 1002:164e surfaces: xcb,xlib device: 2 type: cpu name: llvmpipe
(LLVM 17.0.6 256 bits) driver: mesa llvmpipe v: 24.0.7-arch1.3 (LLVM
17.0.6) device-ID: 10005:0000 surfaces: xcb,xlib
Audio:
Device-1: NVIDIA vendor: Micro-Star MSI driver: snd_hda_intel v: kernel
pcie: gen: 4 speed: 16 GT/s lanes: 16 bus-ID: 01:00.1 chip-ID: 10de:22bc
class-ID: 0403
Device-2: AMD Rembrandt Radeon High Definition Audio
vendor: Micro-Star MSI driver: snd_hda_intel v: kernel pcie: gen: 4
speed: 16 GT/s lanes: 16 bus-ID: 10:00.1 chip-ID: 1002:1640 class-ID: 0403
Device-3: AMD Family 17h/19h HD Audio vendor: Micro-Star MSI
driver: snd_hda_intel v: kernel pcie: gen: 4 speed: 16 GT/s lanes: 16
bus-ID: 10:00.6 chip-ID: 1022:15e3 class-ID: 0403
API: ALSA v: k6.8.9-zen1-2-zen status: kernel-api with: aoss
type: oss-emulator tools: N/A
Server-1: PipeWire v: 1.0.6 status: active with: 1: pipewire-pulse
status: active 2: wireplumber status: active 3: pipewire-alsa type: plugin
4: pw-jack type: plugin tools: pactl,pw-cat,pw-cli,wpctl
Network:
Device-1: Realtek RTL8125 2.5GbE vendor: Micro-Star MSI driver: r8169
v: kernel pcie: gen: 2 speed: 5 GT/s lanes: 1 port: e000 bus-ID: 0c:00.0
chip-ID: 10ec:8125 class-ID: 0200
IF: enp12s0 state: down mac: <filter>
Device-2: ASUSTek ASUS USB-AC58 USB Wireless adapter driver: rtl88x2bu
type: USB rev: 2.1 speed: 480 Mb/s lanes: 1 mode: 2.0 bus-ID: 3-2:4
chip-ID: 0b05:19aa class-ID: 0000 serial: <filter>
IF: wlan0 state: up mac: <filter>
Info: services: iwd, NetworkManager, smbd, systemd-timesyncd
Drives:
Local Storage: total: 953.87 GiB used: 191.05 GiB (20.0%)
SMART Message: Unable to run smartctl. Root privileges required.
ID-1: /dev/nvme0n1 maj-min: 259:0 vendor: Seagate
model: XPG GAMMIX S11 Pro size: 953.87 GiB block-size: physical: 512 B
logical: 512 B speed: 31.6 Gb/s lanes: 4 tech: SSD serial: <filter>
fw-rev: 42BFU6MI temp: 33.9 C scheme: GPT
Partition:
ID-1: / raw-size: 237.98 GiB size: 237.98 GiB (100.00%)
used: 190.68 GiB (80.1%) fs: btrfs dev: /dev/nvme0n1p7 maj-min: 259:7
ID-2: /boot raw-size: 500 MiB size: 500 MiB (100.00%)
used: 344.6 MiB (68.9%) fs: btrfs dev: /dev/nvme0n1p6 maj-min: 259:6
ID-3: /boot/efi raw-size: 100 MiB size: 96 MiB (96.00%)
used: 34 MiB (35.5%) fs: vfat dev: /dev/nvme0n1p1 maj-min: 259:1
ID-4: /home raw-size: 237.98 GiB size: 237.98 GiB (100.00%)
used: 190.68 GiB (80.1%) fs: btrfs dev: /dev/nvme0n1p7 maj-min: 259:7
ID-5: /var/log raw-size: 237.98 GiB size: 237.98 GiB (100.00%)
used: 190.68 GiB (80.1%) fs: btrfs dev: /dev/nvme0n1p7 maj-min: 259:7
ID-6: /var/tmp raw-size: 237.98 GiB size: 237.98 GiB (100.00%)
used: 190.68 GiB (80.1%) fs: btrfs dev: /dev/nvme0n1p7 maj-min: 259:7
Swap:
Kernel: swappiness: 133 (default 60) cache-pressure: 100 (default) zswap: no
ID-1: swap-1 type: file size: 16 GiB used: 0 KiB (0.0%) priority: -2
file: /swap/swapfile
ID-2: swap-2 type: zram size: 14.81 GiB used: 0 KiB (0.0%) priority: 100
comp: zstd avail: lzo,lzo-rle,lz4,lz4hc,842 max-streams: 12 dev: /dev/zram0
Sensors:
System Temperatures: cpu: 37.6 C mobo: N/A
Fan Speeds (rpm): N/A
GPU: device: nvidia screen: :0.0 temp: 39 C fan: 0% device: amdgpu
temp: 34.0 C
Info:
Memory: total: 16 GiB note: est. available: 14.82 GiB used: 4.27 GiB (28.8%)
Processes: 388 Power: uptime: 32m states: freeze,mem,disk suspend: deep
avail: s2idle wakeups: 0 hibernate: platform avail: shutdown, reboot,
suspend, test_resume image: 5.88 GiB services: org_kde_powerdevil,
power-profiles-daemon, upowerd Init: systemd v: 255 default: graphical
tool: systemctl
Packages: pm: pacman pkgs: 1942 libs: 574 tools: octopi,pamac,paru
Compilers: clang: 17.0.6 gcc: 14.1.1 alt: 13 Shell: garuda-inxi
default: fish v: 3.7.1 running-in: konsole inxi: 3.3.34
Garuda (2.6.26-1):
System install date:     2024-05-11
Last full system update: 2024-05-15
Is partially upgraded:   No
Relevant software:       snapper NetworkManager dracut nvidia-dkms
Windows dual boot:       Probably (Run as root to verify)
Failed units:            nmb.service

I have the same with 6.8.9-AMD-znver3, but only on KDE.
I use the zen kernel.
On Hyprland and i3wm, no problem.

 ╭─sgs@i3 in ~ took 9ms
🕙 11:15:23
 ╰─λ mhwd-kernel -li
Currently running: 6.8.9-AMD-znver3 (linux-amd-znver3)
The following kernels are installed in your system:
local/linux-amd-znver3 6.8.v.9-1
local/linux-zen 6.8.9.zen1-2

I think we just must wait for the upstream fix.

4 Likes